Reaction Details
Target72 kDa type IV collagenase
LigandBDBM50427868
Substrate/Competitorn/a
Meas. Tech.ChEMBL_940792 (CHEMBL2330238)
Kd 15±n/a nM
Citation Casalini, FFugazza, LEsposito, GCabella, CBrioschi, CCordaro, AD'Angeli, LBartoli, AFilannino, AMGringeri, CVLongo, DLMuzio, VNuti, EOrlandini, EFiglia, GQuattrini, ATei, LDigilio, GRossello, AMaiocchi, A Synthesis and preliminary evaluation in tumor bearing mice of new (18)F-labeled arylsulfone matrix metalloproteinase inhibitors as tracers for positron emission tomography. J Med Chem56:2676-89 (2013) 
 
72 kDa type IV collagenase
Name:72 kDa type IV collagenase
Type:Enzyme
Mol. Mass.:73870.36
Organism:Homo sapiens (Human)
Description: P08253
Residue:660
BDBM50427868
NameBDBM50427868
Synonyms:CHEMBL2326366
TypeSmall organic molecule
Emp. Form.C22H19FO5S
Mol. Mass.414.447
SMILESOC(=O)Cc1ccccc1S(=O)(=O)c1ccc(cc1)-c1ccc(OCCF)cc1