Reaction Details
TargetSerine/threonine-protein kinase mTOR
LigandBDBM50428130
Substrate/Competitorn/a
Meas. Tech.ChEMBL_944986 (CHEMBL2344477)
Ki 4.8±n/a nM
Citation Pei, ZBlackwood, ELiu, LMalek, SBelvin, MKoehler, MFOrtwine, DFChen, HCohen, FKenny, JRBergeron, PLau, KLy, CZhao, XEstrada, AATruong, TEpler, JANonomiya, JTrinh, LSideris, SLesnick, JBao, LVijapurkar, UMukadam, STay, SDeshmukh, GChen, YHDing, XFriedman, LSLyssikatos, JP Discovery and Biological Profiling of Potent and Selective mTOR Inhibitor GDC-0349. ACS Med Chem Lett4:103-7 (2013) 
 
Serine/threonine-protein kinase mTOR
Name:Serine/threonine-protein kinase mTOR
Type:Rapamycin target protein
Mol. Mass.:288917.12
Organism:Homo sapiens (Human)
Description:P42345
Residue:2549
BDBM50428130
NameBDBM50428130
Synonyms:CHEMBL2331558
TypeSmall organic molecule
Emp. Form.C26H36N6O2
Mol. Mass.464.603
SMILESCCNC(=O)Nc1ccc(cc1)-c1nc2CN(CCc2c(n1)N1CCOC[C@@H]1C)C1CCCC1