Reaction Details
TargetSerine/threonine-protein kinase mTOR
LigandBDBM50428132
Substrate/Competitorn/a
Meas. Tech.ChEMBL_944986 (CHEMBL2344477)
Ki 6.6±n/a nM
Citation Pei, ZBlackwood, ELiu, LMalek, SBelvin, MKoehler, MFOrtwine, DFChen, HCohen, FKenny, JRBergeron, PLau, KLy, CZhao, XEstrada, AATruong, TEpler, JANonomiya, JTrinh, LSideris, SLesnick, JBao, LVijapurkar, UMukadam, STay, SDeshmukh, GChen, YHDing, XFriedman, LSLyssikatos, JP Discovery and Biological Profiling of Potent and Selective mTOR Inhibitor GDC-0349. ACS Med Chem Lett4:103-7 (2013) 
 
Serine/threonine-protein kinase mTOR
Name:Serine/threonine-protein kinase mTOR
Type:Rapamycin target protein
Mol. Mass.:288917.12
Organism:Homo sapiens (Human)
Description:P42345
Residue:2549
BDBM50428132
NameBDBM50428132
Synonyms:CHEMBL2331686
TypeSmall organic molecule
Emp. Form.C26H26N8O2
Mol. Mass.482.537
SMILESO=c1cccc(Nc2ccc(cc2)-c2nc3CN(CCc3c(n2)N2CCOCC2)c2ncccn2)[nH]1