Reaction Details
TargetFarnesyl pyrophosphate synthase
LigandBDBM12578
Substrate/Competitorn/a
Meas. Tech.ChEMBL_947371 (CHEMBL2344604)
IC50 100±n/a nM
Citation Zhang, YZhu, WLiu, YLWang, HWang, KLi, KNo, JHAyong, LGulati, APang, RFreitas-Junior, LMorita, CTOld-Field, E Chemo-Immunotherapeutic Anti-Malarials Targeting Isoprenoid Biosynthesis. ACS Med Chem Lett4:423-427 (2013) 
 
Farnesyl pyrophosphate synthase
Name:Farnesyl pyrophosphate synthase
Type:Enzyme
Mol. Mass.:48272.89
Organism:Homo sapiens (Human)
Description:P14324
Residue:419
BDBM12578
NameBDBM12578
Synonyms:2-(imidazol-1-yl)-1-hydroxyethylidene-1,1-bisphosphonic acid CGP-42446 JMC515594 Compound 55 US11279719, Example Zolendronic acid (ZOL) Zoledronate [1-hydroxy-2-(1H-imidazol-1-yl)-1-phosphonoethyl]phosphonic acid | zoledronic acid
TypeSmall organic molecule
Emp. Form.C5H10N2O7P2
Mol. Mass.272.0896
SMILESOC(Cn1ccnc1)(P(O)(O)=O)P(O)(O)=O