Reaction Details
TargetFarnesyl pyrophosphate synthase
LigandBDBM50428291
Substrate/Competitorn/a
Meas. Tech.ChEMBL_947371 (CHEMBL2344604)
IC50 34±n/a nM
Citation Zhang, YZhu, WLiu, YLWang, HWang, KLi, KNo, JHAyong, LGulati, APang, RFreitas-Junior, LMorita, CTOld-Field, E Chemo-Immunotherapeutic Anti-Malarials Targeting Isoprenoid Biosynthesis. ACS Med Chem Lett4:423-427 (2013) 
 
Farnesyl pyrophosphate synthase
Name:Farnesyl pyrophosphate synthase
Type:Enzyme
Mol. Mass.:48272.89
Organism:Homo sapiens (Human)
Description:P14324
Residue:419
BDBM50428291
NameBDBM50428291
Synonyms:CHEMBL2338355
TypeSmall organic molecule
Emp. Form.C8H16N2O7P2
Mol. Mass.314.1694
SMILESCCCn1cc[n+](CC(O)(P(O)(O)=O)P(O)([O-])=O)c1