Reaction Details
TargetFarnesyl pyrophosphate synthase
LigandBDBM50428294
Substrate/Competitorn/a
Meas. Tech.ChEMBL_947371 (CHEMBL2344604)
IC50 44±n/a nM
Citation Zhang, YZhu, WLiu, YLWang, HWang, KLi, KNo, JHAyong, LGulati, APang, RFreitas-Junior, LMorita, CTOld-Field, E Chemo-Immunotherapeutic Anti-Malarials Targeting Isoprenoid Biosynthesis. ACS Med Chem Lett4:423-427 (2013) 
 
Farnesyl pyrophosphate synthase
Name:Farnesyl pyrophosphate synthase
Type:Enzyme
Mol. Mass.:48272.89
Organism:Homo sapiens (Human)
Description:P14324
Residue:419
BDBM50428294
NameBDBM50428294
Synonyms:CHEMBL2338358
TypeSmall organic molecule
Emp. Form.C11H22N2O7P2
Mol. Mass.356.2491
SMILESCCCCCCn1cc[n+](CC(O)(P(O)(O)=O)P(O)([O-])=O)c1