Reaction Details
TargetFarnesyl pyrophosphate synthase
LigandBDBM50428319
Substrate/Competitorn/a
Meas. Tech.ChEMBL_947369 (CHEMBL2344602)
IC50 1100±n/a nM
Citation Zhang, YZhu, WLiu, YLWang, HWang, KLi, KNo, JHAyong, LGulati, APang, RFreitas-Junior, LMorita, CTOld-Field, E Chemo-Immunotherapeutic Anti-Malarials Targeting Isoprenoid Biosynthesis. ACS Med Chem Lett4:423-427 (2013) 
 
Farnesyl pyrophosphate synthase
Name:Farnesyl pyrophosphate synthase
Type:Enzyme
Mol. Mass.:48272.89
Organism:Homo sapiens (Human)
Description:P14324
Residue:419
BDBM50428319
NameBDBM50428319
Synonyms:CHEMBL2338382
TypeSmall organic molecule
Emp. Form.C19H38N2O6P2
Mol. Mass.452.4623
n1cc[n+](CC(P(O)(O)=O)P(O)([O-])=O)c1