Reaction Details
TargetFarnesyl pyrophosphate synthase
LigandBDBM50428297
Substrate/Competitorn/a
Meas. Tech.ChEMBL_947369 (CHEMBL2344602)
IC50 120±n/a nM
Citation Zhang, YZhu, WLiu, YLWang, HWang, KLi, KNo, JHAyong, LGulati, APang, RFreitas-Junior, LMorita, CTOld-Field, E Chemo-Immunotherapeutic Anti-Malarials Targeting Isoprenoid Biosynthesis. ACS Med Chem Lett4:423-427 (2013) 
 
Farnesyl pyrophosphate synthase
Name:Farnesyl pyrophosphate synthase
Type:Enzyme
Mol. Mass.:48272.89
Organism:Homo sapiens (Human)
Description:P14324
Residue:419
BDBM50428297
NameBDBM50428297
Synonyms:CHEMBL2338361
TypeSmall organic molecule
Emp. Form.C14H28N2O7P2
Mol. Mass.398.3288
SMILESCCCCCCCCCn1cc[n+](CC(O)(P(O)(O)=O)P(O)([O-])=O)c1