Reaction Details
TargetProto-oncogene tyrosine-protein kinase Src
LigandBDBM50299218
Substrate/Competitorn/a
Meas. Tech.ChEMBL_947987 (CHEMBL2344637)
IC50 1.1±n/a nM
Citation Lafleur, KDong, JHuang, DCaflisch, ANevado, C Optimization of inhibitors of the tyrosine kinase EphB4. 2. Cellular potency improvement and binding mode validation by X-ray crystallography. J Med Chem56:84-96 (2013) 
 
Proto-oncogene tyrosine-protein kinase Src
Name:Proto-oncogene tyrosine-protein kinase Src
Type:Protein
Mol. Mass.:59838.60
Organism:Homo sapiens (Human)
Description:P12931
Residue:536
BDBM50299218
NameBDBM50299218
Synonyms:8-(2-Methoxyphenyl)-1-methyl-7-(2'-methyl-5'-hydroxyphenyl-1H-imidazo[2,1-f]purine-2,4(3H,8H)-dione Cpd66
TypeSmall organic molecule
Emp. Form.C22H19N5O4
Mol. Mass.417.4174
SMILESCOc1ccccc1-n1c(cn2c1nc1n(C)c(=O)[nH]c(=O)c21)-c1cc(O)ccc1C