Reaction Details
TargetcGMP-specific 3',5'-cyclic phosphodiesterase
LigandBDBM14777
Substrate/Competitorn/a
Meas. Tech.ChEMBL_948055 (CHEMBL2345130)
IC50 1.2±n/a nM
Citation Fiorito, JSaeed, FZhang, HStaniszewski, AFeng, YFrancis, YIRao, SThakkar, DMDeng, SXLandry, DWArancio, O Synthesis of quinoline derivatives: discovery of a potent and selective phosphodiesterase 5 inhibitor for the treatment of Alzheimer's disease. Eur J Med Chem60:285-94 (2013) 
 
cGMP-specific 3',5'-cyclic phosphodiesterase
Name:cGMP-specific 3',5'-cyclic phosphodiesterase
Type:Protein
Mol. Mass.:99975.83
Organism:Homo sapiens (Human)
Description:O76074
Residue:875
BDBM14777
NameBDBM14777
Synonyms:(2R,8R)-2-(2H-1,3-benzodioxol-5-yl)-6-methyl-3,6,17-triazatetracyclo[8.7.0.0^{3,8}.0^{11,16}]heptadeca-1(10),11(16),12,14-tetraene-4,7-dione CHEMBL779 GF 196960 | Tadalafil
TypeSmall organic molecule
Emp. Form.C22H19N3O4
Mol. Mass.389.404
SMILES[H][C@]12Cc3c([nH]c4ccccc34)[C@H](N1C(=O)CN(C)C2=O)c1ccc2OCOc2c1