Reaction Details
TargetEpithelial discoidin domain-containing receptor 1
LigandBDBM50430862
Substrate/Competitorn/a
Meas. Tech.ChEMBL_945426 (CHEMBL2342537)
IC50 4.0±n/a nM
Citation Gao, MDuan, LLuo, JZhang, LLu, XZhang, YZhang, ZTu, ZXu, YRen, XDing, K Discovery and optimization of 3-(2-(Pyrazolo[1,5-a]pyrimidin-6-yl)ethynyl)benzamides as novel selective and orally bioavailable discoidin domain receptor 1 (DDR1) inhibitors. J Med Chem56:3281-95 (2013) 
 
Epithelial discoidin domain-containing receptor 1
Name:Epithelial discoidin domain-containing receptor 1
Type:Tyrosine-protein kinase
Mol. Mass.:101130.02
Organism:Homo sapiens (Human)
Description:Q08345
Residue:913
BDBM50430862
NameBDBM50430862
Synonyms:CHEMBL2336040
TypeSmall organic molecule
Emp. Form.C23H18N4O2
Mol. Mass.382.4146
SMILESCOc1cccc(NC(=O)c2ccc(C)c(c2)C#Cc2cnc3ccnn3c2)c1