Reaction Details
TargetDiscoidin domain-containing receptor 2
LigandBDBM13216
Substrate/Competitorn/a
Meas. Tech.ChEMBL_945425 (CHEMBL2342536)
IC50 12±n/a nM
Citation Gao, MDuan, LLuo, JZhang, LLu, XZhang, YZhang, ZTu, ZXu, YRen, XDing, K Discovery and optimization of 3-(2-(Pyrazolo[1,5-a]pyrimidin-6-yl)ethynyl)benzamides as novel selective and orally bioavailable discoidin domain receptor 1 (DDR1) inhibitors. J Med Chem56:3281-95 (2013) 
 
Discoidin domain-containing receptor 2
Name:Discoidin domain-containing receptor 2
Type:Protein
Mol. Mass.:96717.07
Organism:Homo sapiens (Human)
Description:Q16832
Residue:855
BDBM13216
NameBDBM13216
Synonyms:BMS-354825 DASATINIB N-(2-chloro-6-methylphenyl)-2-({6-[4-(2-hydroxyethyl)piperazin-1-yl]-2-methylpyrimidin-4-yl}amino)-1,3-thiazole-5-carboxamide US20230348453, Compound A8 med.21724, Compound Dasatinib
TypeSmall organic molecule
Emp. Form.C22H26ClN7O2S
Mol. Mass.488.006
SMILESCc1nc(Nc2ncc(s2)C(=O)Nc2c(C)cccc2Cl)cc(n1)N1CCN(CCO)CC1