Reaction Details
TargetDipeptidyl peptidase 8
LigandBDBM50050513
Substrate/Competitorn/a
Meas. Tech.ChEMBL_949255 (CHEMBL2346131)
IC50 5.5±n/a nM
Citation Poplawski, SELai, JHLi, YJin, ZLiu, YWu, WWu, YZhou, YSudmeier, JLSanford, DGBachovchin, WW Identification of selective and potent inhibitors of fibroblast activation protein and prolyl oligopeptidase. J Med Chem56:3467-77 (2013) 
 
Dipeptidyl peptidase 8
Name:Dipeptidyl peptidase 8
Type:Enzyme
Mol. Mass.:103342.62
Organism:Homo sapiens (Human)
Description:Q6V1X1
Residue:898
BDBM50050513
NameBDBM50050513
Synonyms:(R)-1-((S)-2-amino-3-methylbutanoyl)pyrrolidin-2-ylboronic acid (S)-2-Amino-3-methyl-2-boronic acid-1-pyrrolidin-1-yl-butan-1-one CHEMBL67279 Pyrrolidine derivative US11504364, Compound Val-boroPro US11707539, Compound 2054
TypeSmall organic molecule
Emp. Form.C9H19BN2O3
Mol. Mass.214.07
SMILESCC(C)[C@H](N)C(=O)N1CCC[C@H]1B(O)O