Reaction Details
TargetBeta-secretase 1
LigandBDBM50432602
Substrate/Competitorn/a
Meas. Tech.ChEMBL_951004 (CHEMBL2350618)
IC50 10±n/a nM
Citation Hilpert, HGuba, WWoltering, TJWostl, WPinard, EMauser, HMayweg, AVRogers-Evans, MHumm, RKrummenacher, DMuser, TSchnider, CJacobsen, HOzmen, LBergadano, ABanner, DWHochstrasser, RKuglstatter, ADavid-Pierson, PFischer, HPolara, ANarquizian, R ß-Secretase (BACE1) inhibitors with high in vivo efficacy suitable for clinical evaluation in Alzheimer's disease. J Med Chem56:3980-95 (2013) 
 
Beta-secretase 1
Name:Beta-secretase 1
Type:Protein
Mol. Mass.:55755.10
Organism:Homo sapiens (Human)
Description:P56817
Residue:501
BDBM50432602
NameBDBM50432602
Synonyms:CHEMBL2347188
TypeSmall organic molecule
Emp. Form.C19H14F5N5O2
Mol. Mass.439.3388
SMILESC[C@@]1(N=C(N)O[C@@H]([C@@H]1F)C(F)(F)F)c1cc(NC(=O)c2ccc(cn2)C#N)ccc1F