Reaction Details
TargetBeta-secretase 1
LigandBDBM50432605
Substrate/Competitorn/a
Meas. Tech.ChEMBL_950722 (CHEMBL2353183)
IC50 776±n/a nM
Citation Hilpert, HGuba, WWoltering, TJWostl, WPinard, EMauser, HMayweg, AVRogers-Evans, MHumm, RKrummenacher, DMuser, TSchnider, CJacobsen, HOzmen, LBergadano, ABanner, DWHochstrasser, RKuglstatter, ADavid-Pierson, PFischer, HPolara, ANarquizian, R ß-Secretase (BACE1) inhibitors with high in vivo efficacy suitable for clinical evaluation in Alzheimer's disease. J Med Chem56:3980-95 (2013) 
 
Beta-secretase 1
Name:Beta-secretase 1
Type:Protein
Mol. Mass.:55755.10
Organism:Homo sapiens (Human)
Description:P56817
Residue:501
BDBM50432605
NameBDBM50432605
Synonyms:CHEMBL2347207
TypeSmall organic molecule
Emp. Form.C19H15F4N5O2
Mol. Mass.421.3483
SMILESC[C@]1(C[C@@H](OC(N)=N1)C(F)(F)F)c1cc(NC(=O)c2ccc(cn2)C#N)ccc1F