Reaction Details
TargetPepsin A
LigandBDBM50432601
Substrate/Competitorn/a
Meas. Tech.ChEMBL_950727 (CHEMBL2353188)
IC50>200000±n/a nM
Citation Hilpert, HGuba, WWoltering, TJWostl, WPinard, EMauser, HMayweg, AVRogers-Evans, MHumm, RKrummenacher, DMuser, TSchnider, CJacobsen, HOzmen, LBergadano, ABanner, DWHochstrasser, RKuglstatter, ADavid-Pierson, PFischer, HPolara, ANarquizian, R ß-Secretase (BACE1) inhibitors with high in vivo efficacy suitable for clinical evaluation in Alzheimer's disease. J Med Chem56:3980-95 (2013) 
 
Pepsin A
Name:Pepsin A
Type:Enzyme
Mol. Mass.:41232.87
Organism:Porcine
Description:n/a
Residue:385
BDBM50432601
NameBDBM50432601
Synonyms:CHEMBL2347208 | US9296734, 102
TypeSmall organic molecule
Emp. Form.C19H15F4N5O2
Mol. Mass.421.3483
SMILESC[C@]1(C[C@H](OC(N)=N1)C(F)(F)F)c1cc(NC(=O)c2ccc(cn2)C#N)ccc1F