Reaction Details
TargetCytochrome P450 2D6
LigandBDBM50432601
Substrate/Competitorn/a
Meas. Tech.ChEMBL_950734 (CHEMBL2353195)
IC50>25000±n/a nM
Citation Hilpert, HGuba, WWoltering, TJWostl, WPinard, EMauser, HMayweg, AVRogers-Evans, MHumm, RKrummenacher, DMuser, TSchnider, CJacobsen, HOzmen, LBergadano, ABanner, DWHochstrasser, RKuglstatter, ADavid-Pierson, PFischer, HPolara, ANarquizian, R ß-Secretase (BACE1) inhibitors with high in vivo efficacy suitable for clinical evaluation in Alzheimer's disease. J Med Chem56:3980-95 (2013) 
 
Cytochrome P450 2D6
Name:Cytochrome P450 2D6
Type:Protein
Mol. Mass.:55774.82
Organism:Homo sapiens (Human)
Description:P10635
Residue:497
BDBM50432601
NameBDBM50432601
Synonyms:CHEMBL2347208 | US9296734, 102
TypeSmall organic molecule
Emp. Form.C19H15F4N5O2
Mol. Mass.421.3483
SMILESC[C@]1(C[C@H](OC(N)=N1)C(F)(F)F)c1cc(NC(=O)c2ccc(cn2)C#N)ccc1F