Reaction Details
TargetE3 ubiquitin-protein ligase Mdm2
LigandBDBM50397778
Substrate/Competitorn/a
Meas. Tech.ChEMBL_951638 (CHEMBL2351552)
IC50 18100±n/a nM
Citation Gonzalez-Lopez de Turiso, FSun, DRew, YBartberger, MDBeck, HPCanon, JChen, AChow, DCorrell, TLHuang, XJulian, LDKayser, FLo, MCLong, AMMcMinn, DOliner, JDOsgood, TPowers, JPSaiki, AYSchneider, SShaffer, PXiao, SHYakowec, PYan, XYe, QYu, DZhao, XZhou, JMedina, JCOlson, SH Rational design and binding mode duality of MDM2-p53 inhibitors. J Med Chem56:4053-70 (2013) 
 
E3 ubiquitin-protein ligase Mdm2
Name:E3 ubiquitin-protein ligase Mdm2
Type:Oncoprotein
Mol. Mass.:55196.54
Organism:Homo sapiens (Human)
Description:Q00987
Residue:491
BDBM50397778
NameBDBM50397778
Synonyms:CHEMBL2177813 | US9593129, Example 35
TypeSmall organic molecule
Emp. Form.C23H23Cl2NO3
Mol. Mass.432.34
SMILESOC(=O)C[C@H]1C[C@@H]([C@H](N(CC2CC2)C1=O)c1ccc(Cl)cc1)c1cccc(Cl)c1