Reaction Details
TargetMethionine aminopeptidase 2
LigandBDBM50433373
Substrate/Competitorn/a
Meas. Tech.ChEMBL_957169 (CHEMBL2378707)
EC50>100000±n/a nM
Citation Zhang, FBhat, SGabelli, SBChen, XMiller, MSNacev, BACheng, YLMeyers, DJTenney, KShim, JSCrews, PAmzel, LMMa, DLiu, JO Pyridinylquinazolines selectively inhibit human methionine aminopeptidase-1 in cells. J Med Chem56:3996-4016 (2013) 
 
Methionine aminopeptidase 2
Name:Methionine aminopeptidase 2
Type:Enzyme
Mol. Mass.:52884.45
Organism:Homo sapiens (Human)
Description:P50579
Residue:478
BDBM50433373
NameBDBM50433373
Synonyms:CHEMBL2375609
TypeSmall organic molecule
Emp. Form.C29H29N5O2
Mol. Mass.479.5729
SMILESCC(=O)N[C@@H](Cc1ccccc1)C(=O)N1CCN(CC1)c1cc(nc2ccccc12)-c1ccccn1