Reaction Details
TargetMethionine aminopeptidase 1
LigandBDBM50042874
Substrate/Competitorn/a
Meas. Tech.ChEMBL_957176 (CHEMBL2378714)
EC50>100000±n/a nM
Citation Zhang, FBhat, SGabelli, SBChen, XMiller, MSNacev, BACheng, YLMeyers, DJTenney, KShim, JSCrews, PAmzel, LMMa, DLiu, JO Pyridinylquinazolines selectively inhibit human methionine aminopeptidase-1 in cells. J Med Chem56:3996-4016 (2013) 
 
Methionine aminopeptidase 1
Name:Methionine aminopeptidase 1
Type:Enzyme
Mol. Mass.:43220.79
Organism:Homo sapiens (Human)
Description:MetAP1 with an N-terminal six histidine tag was expressed in baculovirus infected sf9 cells.
Residue:386
BDBM50042874
NameBDBM50042874
Synonyms:2,2'-Bipyridin 2,2'-bipyridyl 2,2'-dipyridyl CHEMBL39879 alpha,alpha'-bipyridine alpha,alpha'-dipyridine bpy
TypeSmall organic molecule
Emp. Form.C10H8N2
Mol. Mass.156.1839
SMILESc1ccc(nc1)-c1ccccn1