Reaction Details
TargetMethionine aminopeptidase 1
LigandBDBM17847
Substrate/Competitorn/a
Meas. Tech.ChEMBL_957176 (CHEMBL2378714)
EC50>40000±n/a nM
Citation Zhang, FBhat, SGabelli, SBChen, XMiller, MSNacev, BACheng, YLMeyers, DJTenney, KShim, JSCrews, PAmzel, LMMa, DLiu, JO Pyridinylquinazolines selectively inhibit human methionine aminopeptidase-1 in cells. J Med Chem56:3996-4016 (2013) 
 
Methionine aminopeptidase 1
Name:Methionine aminopeptidase 1
Type:Enzyme
Mol. Mass.:43220.79
Organism:Homo sapiens (Human)
Description:MetAP1 with an N-terminal six histidine tag was expressed in baculovirus infected sf9 cells.
Residue:386
BDBM17847
NameBDBM17847
Synonyms:CHEMBL327579 tert-butyl N-[2-(1,3-thiazol-2-ylcarbamoyl)pyridin-3-yl]carbamate
TypeSmall organic molecule
Emp. Form.C14H16N4O3S
Mol. Mass.320.367
SMILESCC(C)(C)OC(=O)Nc1cccnc1C(=O)Nc1nccs1