Reaction Details
TargetMethionine aminopeptidase 2
LigandBDBM50433380
Substrate/Competitorn/a
Meas. Tech.ChEMBL_957169 (CHEMBL2378707)
EC50>300000±n/a nM
Citation Zhang, FBhat, SGabelli, SBChen, XMiller, MSNacev, BACheng, YLMeyers, DJTenney, KShim, JSCrews, PAmzel, LMMa, DLiu, JO Pyridinylquinazolines selectively inhibit human methionine aminopeptidase-1 in cells. J Med Chem56:3996-4016 (2013) 
 
Methionine aminopeptidase 2
Name:Methionine aminopeptidase 2
Type:Enzyme
Mol. Mass.:52884.45
Organism:Homo sapiens (Human)
Description:P50579
Residue:478
BDBM50433380
NameBDBM50433380
Synonyms:CHEMBL2375612
TypeSmall organic molecule
Emp. Form.C23H19N5
Mol. Mass.365.4305
SMILESC(Cc1[nH]cc2ccccc12)Nc1nc(nc2ccccc12)-c1ccccn1