Reaction Details
TargetMethionine aminopeptidase 2
LigandBDBM50433381
Substrate/Competitorn/a
Meas. Tech.ChEMBL_957169 (CHEMBL2378707)
EC50>100000±n/a nM
Citation Zhang, FBhat, SGabelli, SBChen, XMiller, MSNacev, BACheng, YLMeyers, DJTenney, KShim, JSCrews, PAmzel, LMMa, DLiu, JO Pyridinylquinazolines selectively inhibit human methionine aminopeptidase-1 in cells. J Med Chem56:3996-4016 (2013) 
 
Methionine aminopeptidase 2
Name:Methionine aminopeptidase 2
Type:Enzyme
Mol. Mass.:52884.45
Organism:Homo sapiens (Human)
Description:P50579
Residue:478
BDBM50433381
NameBDBM50433381
Synonyms:CHEMBL2375613
TypeSmall organic molecule
Emp. Form.C18H18N4
Mol. Mass.290.3623
SMILESC1CCN(CC1)c1nc(nc2ccccc12)-c1ccccn1