Reaction Details
TargetPhosphatidylinositol 4,5-bisphosphate 3-kinase catalytic subunit delta isoform
LigandBDBM50433545
Substrate/Competitorn/a
Meas. Tech.ChEMBL_959697 (CHEMBL2383017)
IC50 0.600000±n/a nM
Citation Staben, STNdubaku, CBlaquiere, NBelvin, MBull, RJDudley, DEdgar, KGray, DHeald, RHeffron, TPJones, GEJones, MKolesnikov, ALee, LLesnick, JLewis, CMurray, JMcLean, NJNonomiya, JOlivero, AGOrd, RPang, JPrice, SPrior, WWRouge, LSalphati, LSampath, DWallin, JWang, LWei, BWeismann, CWu, P Discovery of thiazolobenzoxepin PI3-kinase inhibitors that spare the PI3-kinaseß isoform. Bioorg Med Chem Lett23:2606-13 (2013) 
 
Phosphatidylinositol 4,5-bisphosphate 3-kinase catalytic subunit delta isoform
Name:Phosphatidylinositol 4,5-bisphosphate 3-kinase catalytic subunit delta isoform
Type:Enzyme Subunit
Mol. Mass.:119489.41
Organism:Homo sapiens (Human)
Description:O00329
Residue:1044
BDBM50433545
NameBDBM50433545
Synonyms:CHEMBL2381271
TypeSmall organic molecule
Emp. Form.C20H20N6OS
Mol. Mass.392.477
SMILESCC(C)n1ncnc1-c1nc-2c(CCOc3cc(ccc-23)-c2cn(C)cn2)s1