Reaction Details
TargetPhosphatidylinositol 4,5-bisphosphate 3-kinase catalytic subunit delta isoform
LigandBDBM50433526
Substrate/Competitorn/a
Meas. Tech.ChEMBL_959697 (CHEMBL2383017)
IC50 3.5±n/a nM
Citation Staben, STNdubaku, CBlaquiere, NBelvin, MBull, RJDudley, DEdgar, KGray, DHeald, RHeffron, TPJones, GEJones, MKolesnikov, ALee, LLesnick, JLewis, CMurray, JMcLean, NJNonomiya, JOlivero, AGOrd, RPang, JPrice, SPrior, WWRouge, LSalphati, LSampath, DWallin, JWang, LWei, BWeismann, CWu, P Discovery of thiazolobenzoxepin PI3-kinase inhibitors that spare the PI3-kinaseß isoform. Bioorg Med Chem Lett23:2606-13 (2013) 
 
Phosphatidylinositol 4,5-bisphosphate 3-kinase catalytic subunit delta isoform
Name:Phosphatidylinositol 4,5-bisphosphate 3-kinase catalytic subunit delta isoform
Type:Enzyme Subunit
Mol. Mass.:119489.41
Organism:Homo sapiens (Human)
Description:O00329
Residue:1044
BDBM50433526
NameBDBM50433526
Synonyms:CHEMBL2381253
TypeSmall organic molecule
Emp. Form.C16H16N4OS
Mol. Mass.312.389
SMILESCC(C)n1ncnc1-c1nc-2c(CCOc3ccccc-23)s1