Reaction Details
TargetDihydroorotate dehydrogenase (quinone), mitochondrial
LigandBDBM50434230
Substrate/Competitorn/a
Meas. Tech.ChEMBL_960944 (CHEMBL2388704)
IC50 19±n/a nM
Citation Das, PDeng, XZhang, LRoth, MGFontoura, BMPhillips, MADe Brabander, JK SAR Based Optimization of a 4-Quinoline Carboxylic Acid Analog with Potent Anti-Viral Activity. ACS Med Chem Lett4:517-521 (2013) 
 
Dihydroorotate dehydrogenase (quinone), mitochondrial
Name:Dihydroorotate dehydrogenase (quinone), mitochondrial
Type:Enzyme
Mol. Mass.:42881.33
Organism:Homo sapiens (Human)
Description:Q02127
Residue:395
BDBM50434230
NameBDBM50434230
Synonyms:CHEMBL2385510
TypeSmall organic molecule
Emp. Form.C26H22FNO3
Mol. Mass.415.4562
SMILESCC(C)(C)c1ccc(Oc2ccc(cc2)-c2cc(C(O)=O)c3cc(F)ccc3n2)cc1