Reaction Details
TargetDihydroorotate dehydrogenase (quinone), mitochondrial
LigandBDBM50434231
Substrate/Competitorn/a
Meas. Tech.ChEMBL_960944 (CHEMBL2388704)
IC50 36±n/a nM
Citation Das, PDeng, XZhang, LRoth, MGFontoura, BMPhillips, MADe Brabander, JK SAR Based Optimization of a 4-Quinoline Carboxylic Acid Analog with Potent Anti-Viral Activity. ACS Med Chem Lett4:517-521 (2013) 
 
Dihydroorotate dehydrogenase (quinone), mitochondrial
Name:Dihydroorotate dehydrogenase (quinone), mitochondrial
Type:Enzyme
Mol. Mass.:42881.33
Organism:Homo sapiens (Human)
Description:Q02127
Residue:395
BDBM50434231
NameBDBM50434231
Synonyms:CHEMBL2385515
TypeSmall organic molecule
Emp. Form.C22H14FNO3
Mol. Mass.359.3499
SMILESOC(=O)c1cc(nc2ccc(F)cc12)-c1ccc(Oc2ccccc2)cc1