Reaction Details
TargetIsocitrate dehydrogenase [NADP] cytoplasmic
LigandBDBM50434274
Substrate/Competitorn/a
Meas. Tech.ChEMBL_961313 (CHEMBL2390489)
Ki>50000±n/a nM
Citation Zheng, BYao, YLiu, ZDeng, LAnglin, JLJiang, HPrasad, BVSong, Y Crystallographic Investigation and Selective Inhibition of Mutant Isocitrate Dehydrogenase. ACS Med Chem Lett4:542-546 (2013) 
 
Isocitrate dehydrogenase [NADP] cytoplasmic
Name:Isocitrate dehydrogenase [NADP] cytoplasmic
Type:Protein
Mol. Mass.:46661.29
Organism:Homo sapiens (Human)
Description:O75874
Residue:414
BDBM50434274
NameBDBM50434274
Synonyms:CHEMBL2386129
TypeSmall organic molecule
Emp. Form.C15H17NO2
Mol. Mass.243.301
SMILESCC(C)c1cc(Cc2ccccc2)n(O)c(=O)c1