Reaction Details
TargetPlatelet-derived growth factor receptor beta
LigandBDBM50434377
Substrate/Competitorn/a
Meas. Tech.ChEMBL_961757 (CHEMBL2389575)
IC50 1400±n/a nM
Citation Arcari, JTBeebe, JSBerliner, MABernardo, VBoehm, MBorzillo, GVClark, TCohen, BDConnell, RDFrost, HNGordon, DAHungerford, WMKakar, SMKanter, AKeene, NFKnauth, EALagreca, SDLu, YMartinez-Alsina, LMarx, MAMorris, JPatel, NCSavage, DSoderstrom, CIThompson, CTkalcevic, GTom, NJVajdos, FFValentine, JJVincent, PWWessel, MDChen, JM Discovery and synthesis of novel 4-aminopyrrolopyrimidine Tie-2 kinase inhibitors for the treatment of solid tumors. Bioorg Med Chem Lett23:3059-63 (2013) 
 
Platelet-derived growth factor receptor beta
Name:Platelet-derived growth factor receptor beta
Type:Enzyme
Mol. Mass.:123922.25
Organism:Homo sapiens (Human)
Description:P09619
Residue:1106
BDBM50434377
NameBDBM50434377
Synonyms:CHEMBL2387002
TypeSmall organic molecule
Emp. Form.C23H21ClN6O2
Mol. Mass.448.905
SMILESCC(C)n1cc(C(=O)c2cccc(NC(=O)Nc3ccc(Cl)cc3)c2)c2c(N)ncnc12