Reaction Details
TargetHistamine receptor H3
LigandBDBM50434387
Substrate/Competitorn/a
Meas. Tech.ChEMBL_961066 (CHEMBL2389497)
Ki 7.1±n/a nM
Citation Gao, ZHurst, WJGuillot, ECzechtizky, WLukasczyk, UNagorny, RPruniaux, MPSchwink, LSanchez, JAStengelin, STang, LWinkler, IHendrix, JAGeorge, PG Discovery of aryl ureas and aryl amides as potent and selective histamine H3 receptor antagonists for the treatment of obesity (part I). Bioorg Med Chem Lett23:3416-20 (2013) 
 
Histamine receptor H3
Name:Histamine receptor H3
Synonyms:n/a
Type:Enzyme
Mol. Mass.:48611.84
Organism:Macaca mulatta (Rhesus macaque)
Description:Q865E1
Residue:445
BDBM50434387
NameBDBM50434387
Synonyms:CHEMBL2387290
TypeSmall organic molecule
Emp. Form.C23H28Cl2N4O
Mol. Mass.447.401
SMILESCC1CCCN1C1CCN(C1)c1ccc(NC(=O)NCc2cc(Cl)cc(Cl)c2)cc1