Reaction Details
TargetInhibitor of nuclear factor kappa-B kinase subunit beta
LigandBDBM50434485
Substrate/Competitorn/a
Meas. Tech.ChEMBL_961814 (CHEMBL2389954)
IC50 24000±n/a nM
Citation Xiao, DPalani, AHuang, XSofolarides, MZhou, WChen, XAslanian, RGuo, ZFossetta, JTian, FTrivedi, PSpacciapoli, PWhitehurst, CELundell, D Conformation constraint of anilides enabling the discovery of tricyclic lactams as potent MK2 non-ATP competitive inhibitors. Bioorg Med Chem Lett23:3262-6 (2013) 
 
Inhibitor of nuclear factor kappa-B kinase subunit beta
Name:Inhibitor of nuclear factor kappa-B kinase subunit beta
Type:Serine/threonine-protein kinase
Mol. Mass.:86554.39
Organism:Homo sapiens (Human)
Description:GST-tagged IKK-2 was expressed in High Five cells and purified.
Residue:756
BDBM50434485
NameBDBM50434485
Synonyms:CHEMBL2385543
TypeSmall organic molecule
Emp. Form.C34H29ClN4O2
Mol. Mass.561.073
SMILESClc1ccc(cc1)-c1cc2Cc3cc(ccc3N(Cc3ccccc3-c3cccnc3)C(=O)c2o1)N1CCNCC1