Reaction Details
TargetInterleukin-1 receptor-associated kinase 4
LigandBDBM50434485
Substrate/Competitorn/a
Meas. Tech.ChEMBL_961816 (CHEMBL2389956)
IC50 26000±n/a nM
Citation Xiao, DPalani, AHuang, XSofolarides, MZhou, WChen, XAslanian, RGuo, ZFossetta, JTian, FTrivedi, PSpacciapoli, PWhitehurst, CELundell, D Conformation constraint of anilides enabling the discovery of tricyclic lactams as potent MK2 non-ATP competitive inhibitors. Bioorg Med Chem Lett23:3262-6 (2013) 
 
Interleukin-1 receptor-associated kinase 4
Name:Interleukin-1 receptor-associated kinase 4
Type:Protein
Mol. Mass.:51519.08
Organism:Homo sapiens (Human)
Description:Q9NWZ3
Residue:460
BDBM50434485
NameBDBM50434485
Synonyms:CHEMBL2385543
TypeSmall organic molecule
Emp. Form.C34H29ClN4O2
Mol. Mass.561.073
SMILESClc1ccc(cc1)-c1cc2Cc3cc(ccc3N(Cc3ccccc3-c3cccnc3)C(=O)c2o1)N1CCNCC1