Reaction Details
TargetMAP kinase-activated protein kinase 2
LigandBDBM50434491
Substrate/Competitorn/a
Meas. Tech.ChEMBL_961826 (CHEMBL2389966)
IC50 8.4±n/a nM
Citation Xiao, DPalani, AHuang, XSofolarides, MZhou, WChen, XAslanian, RGuo, ZFossetta, JTian, FTrivedi, PSpacciapoli, PWhitehurst, CELundell, D Conformation constraint of anilides enabling the discovery of tricyclic lactams as potent MK2 non-ATP competitive inhibitors. Bioorg Med Chem Lett23:3262-6 (2013) 
 
MAP kinase-activated protein kinase 2
Name:MAP kinase-activated protein kinase 2
Type:Serine/threonine-protein kinase
Mol. Mass.:45579.87
Organism:Homo sapiens (Human)
Description:P49137
Residue:400
BDBM50434491
NameBDBM50434491
Synonyms:CHEMBL2385545
TypeSmall organic molecule
Emp. Form.C36H31N5O3
Mol. Mass.581.663
SMILESCOc1ncccc1-c1ccccc1CN1c2ccc(cc2Cc2cc(oc2C1=O)-c1ccc(cc1)C#N)N1CCNCC1