Reaction Details
TargetMAP kinase-activated protein kinase 2
LigandBDBM50434503
Substrate/Competitorn/a
Meas. Tech.ChEMBL_961826 (CHEMBL2389966)
IC50 110±n/a nM
Citation Xiao, DPalani, AHuang, XSofolarides, MZhou, WChen, XAslanian, RGuo, ZFossetta, JTian, FTrivedi, PSpacciapoli, PWhitehurst, CELundell, D Conformation constraint of anilides enabling the discovery of tricyclic lactams as potent MK2 non-ATP competitive inhibitors. Bioorg Med Chem Lett23:3262-6 (2013) 
 
MAP kinase-activated protein kinase 2
Name:MAP kinase-activated protein kinase 2
Type:Serine/threonine-protein kinase
Mol. Mass.:45579.87
Organism:Homo sapiens (Human)
Description:P49137
Residue:400
BDBM50434503
NameBDBM50434503
Synonyms:CHEMBL2385533
TypeSmall organic molecule
Emp. Form.C26H26ClN3O2
Mol. Mass.447.957
SMILESClc1ccc(cc1)-c1cc2Cc3cc(ccc3N(CC3CC3)C(=O)c2o1)N1CCNCC1