Reaction Details
TargetReceptor-type tyrosine-protein kinase FLT3
LigandBDBM50434632
Substrate/Competitorn/a
Meas. Tech.ChEMBL_963010 (CHEMBL2390018)
IC50 40±n/a nM
Citation Lin, WHHsu, JTHsieh, SYChen, CTSong, JSYen, SCHsu, TLu, CTChen, CHChou, LHYang, YNChiu, CHChen, CPTseng, YJYen, KJYeh, CFChao, YSYeh, TKJiaang, WT Discovery of 3-phenyl-1H-5-pyrazolylamine derivatives containing a urea pharmacophore as potent and efficacious inhibitors of FMS-like tyrosine kinase-3 (FLT3). Bioorg Med Chem21:2856-67 (2013) 
 
Receptor-type tyrosine-protein kinase FLT3
Name:Receptor-type tyrosine-protein kinase FLT3
Type:Enzyme
Mol. Mass.:112888.62
Organism:Homo sapiens (Human)
Description:P36888
Residue:993
BDBM50434632
NameBDBM50434632
Synonyms:CHEMBL2386816
TypeSmall organic molecule
Emp. Form.C27H28N8O2
Mol. Mass.496.5636
SMILESCN1CCN(CC1)c1ccc(cc1)C(=O)Nc1cc(n[nH]1)-c1ccc(NC(=O)Nc2ccccn2)cc1