Reaction Details
TargetAurora kinase A
LigandBDBM50434607
Substrate/Competitorn/a
Meas. Tech.ChEMBL_963008 (CHEMBL2390016)
IC50 790±n/a nM
Citation Lin, WHHsu, JTHsieh, SYChen, CTSong, JSYen, SCHsu, TLu, CTChen, CHChou, LHYang, YNChiu, CHChen, CPTseng, YJYen, KJYeh, CFChao, YSYeh, TKJiaang, WT Discovery of 3-phenyl-1H-5-pyrazolylamine derivatives containing a urea pharmacophore as potent and efficacious inhibitors of FMS-like tyrosine kinase-3 (FLT3). Bioorg Med Chem21:2856-67 (2013) 
 
Aurora kinase A
Name:Aurora kinase A
Type:Serine/threonine-protein kinase
Mol. Mass.:45830.98
Organism:Homo sapiens (Human)
Description:O14965
Residue:403
BDBM50434607
NameBDBM50434607
Synonyms:CHEMBL2386810
TypeSmall organic molecule
Emp. Form.C26H28ClN9O
Mol. Mass.518.013
SMILESCc1nc(Nc2cc(n[nH]2)-c2ccc(CNC(=O)Nc3cccc(Cl)c3)cc2)cc(n1)N1CCNCC1