Reaction Details
TargetAurora kinase A
LigandBDBM50434620
Substrate/Competitorn/a
Meas. Tech.ChEMBL_963008 (CHEMBL2390016)
IC50 760±n/a nM
Citation Lin, WHHsu, JTHsieh, SYChen, CTSong, JSYen, SCHsu, TLu, CTChen, CHChou, LHYang, YNChiu, CHChen, CPTseng, YJYen, KJYeh, CFChao, YSYeh, TKJiaang, WT Discovery of 3-phenyl-1H-5-pyrazolylamine derivatives containing a urea pharmacophore as potent and efficacious inhibitors of FMS-like tyrosine kinase-3 (FLT3). Bioorg Med Chem21:2856-67 (2013) 
 
Aurora kinase A
Name:Aurora kinase A
Type:Serine/threonine-protein kinase
Mol. Mass.:45830.98
Organism:Homo sapiens (Human)
Description:O14965
Residue:403
BDBM50434620
NameBDBM50434620
Synonyms:CHEMBL2386797
TypeSmall organic molecule
Emp. Form.C30H32N6O4
Mol. Mass.540.6129
SMILESO=C(NCc1ccc(cc1)-c1cc(NC(=O)c2ccc(OCCN3CCOCC3)cc2)[nH]n1)Nc1ccccc1