Reaction Details
TargetAurora kinase A
LigandBDBM50434631
Substrate/Competitorn/a
Meas. Tech.ChEMBL_963008 (CHEMBL2390016)
IC50 300±n/a nM
Citation Lin, WHHsu, JTHsieh, SYChen, CTSong, JSYen, SCHsu, TLu, CTChen, CHChou, LHYang, YNChiu, CHChen, CPTseng, YJYen, KJYeh, CFChao, YSYeh, TKJiaang, WT Discovery of 3-phenyl-1H-5-pyrazolylamine derivatives containing a urea pharmacophore as potent and efficacious inhibitors of FMS-like tyrosine kinase-3 (FLT3). Bioorg Med Chem21:2856-67 (2013) 
 
Aurora kinase A
Name:Aurora kinase A
Type:Serine/threonine-protein kinase
Mol. Mass.:45830.98
Organism:Homo sapiens (Human)
Description:O14965
Residue:403
BDBM50434631
NameBDBM50434631
Synonyms:CHEMBL2386817
TypeSmall organic molecule
Emp. Form.C27H28N8O2
Mol. Mass.496.5636
SMILESCN1CCN(CC1)c1ccc(cc1)C(=O)Nc1cc(n[nH]1)-c1ccc(NC(=O)Nc2cccnc2)cc1