Reaction Details
TargetBifunctional epoxide hydrolase 2
LigandBDBM50435746
Substrate/Competitorn/a
Meas. Tech.ChEMBL_965765 (CHEMBL2393704)
IC50 32±n/a nM
Citation Thalji, RKMcAtee, JJBelyanskaya, SBrandt, MBrown, GDCostell, MHDing, YDodson, JWEisennagel, SHFries, REGross, JWHarpel, MRHolt, DAIsrael, DIJolivette, LJKrosky, DLi, HLu, QMandichak, TRoethke, TSchnackenberg, CGSchwartz, BShewchuk, LMXie, WBehm, DJDouglas, SAShaw, ALMarino, JP Discovery of 1-(1,3,5-triazin-2-yl)piperidine-4-carboxamides as inhibitors of soluble epoxide hydrolase. Bioorg Med Chem Lett23:3584-8 (2013) 
 
Bifunctional epoxide hydrolase 2
Name:Bifunctional epoxide hydrolase 2
Type:Enzyme
Mol. Mass.:62613.07
Organism:Homo sapiens (Human)
Description:P34913
Residue:555
BDBM50435746
NameBDBM50435746
Synonyms:CHEMBL2392705
TypeSmall organic molecule
Emp. Form.C22H26F3N3O
Mol. Mass.405.4565
SMILESCNc1cc(C)cc(c1)N1CCC(CC1)C(=O)NCc1ccccc1C(F)(F)F