Reaction Details
TargetBifunctional epoxide hydrolase 2
LigandBDBM50435747
Substrate/Competitorn/a
Meas. Tech.ChEMBL_965765 (CHEMBL2393704)
IC50 10.0±n/a nM
Citation Thalji, RKMcAtee, JJBelyanskaya, SBrandt, MBrown, GDCostell, MHDing, YDodson, JWEisennagel, SHFries, REGross, JWHarpel, MRHolt, DAIsrael, DIJolivette, LJKrosky, DLi, HLu, QMandichak, TRoethke, TSchnackenberg, CGSchwartz, BShewchuk, LMXie, WBehm, DJDouglas, SAShaw, ALMarino, JP Discovery of 1-(1,3,5-triazin-2-yl)piperidine-4-carboxamides as inhibitors of soluble epoxide hydrolase. Bioorg Med Chem Lett23:3584-8 (2013) 
 
Bifunctional epoxide hydrolase 2
Name:Bifunctional epoxide hydrolase 2
Type:Enzyme
Mol. Mass.:62613.07
Organism:Homo sapiens (Human)
Description:P34913
Residue:555
BDBM50435747
NameBDBM50435747
Synonyms:CHEMBL2392704
TypeSmall organic molecule
Emp. Form.C21H25F3N4O
Mol. Mass.406.4446
SMILESCNc1cc(C)cc(n1)N1CCC(CC1)C(=O)NCc1ccccc1C(F)(F)F