Reaction Details
TargetCytochrome P450 2C9
LigandBDBM50435759
Substrate/Competitorn/a
Meas. Tech.ChEMBL_965762 (CHEMBL2393701)
IC50 9600±n/a nM
Citation Thalji, RKMcAtee, JJBelyanskaya, SBrandt, MBrown, GDCostell, MHDing, YDodson, JWEisennagel, SHFries, REGross, JWHarpel, MRHolt, DAIsrael, DIJolivette, LJKrosky, DLi, HLu, QMandichak, TRoethke, TSchnackenberg, CGSchwartz, BShewchuk, LMXie, WBehm, DJDouglas, SAShaw, ALMarino, JP Discovery of 1-(1,3,5-triazin-2-yl)piperidine-4-carboxamides as inhibitors of soluble epoxide hydrolase. Bioorg Med Chem Lett23:3584-8 (2013) 
 
Cytochrome P450 2C9
Name:Cytochrome P450 2C9
Type:Enzyme
Mol. Mass.:55636.33
Organism:Homo sapiens (Human)
Description:P11712
Residue:490
BDBM50435759
NameBDBM50435759
Synonyms:CHEMBL2392715
TypeSmall organic molecule
Emp. Form.C20H25F3N6O
Mol. Mass.422.4473
SMILESCCc1nc(NC)nc(n1)N1CCC(CC1)C(=O)NCc1ccccc1C(F)(F)F