Reaction Details
TargetNicotinamide phosphoribosyltransferase
LigandBDBM50435766
Substrate/Competitorn/a
Meas. Tech.ChEMBL_966359 (CHEMBL2396492)
IC50 4.0±n/a nM
Citation Gunzner-Toste, JZhao, GBauer, PBaumeister, TBuckmelter, AJCaligiuri, MClodfelter, KHFu, BHan, BHo, YCKley, NLiang, XLiederer, BMLin, JMukadam, SO'Brien, TOh, AReynolds, DJSharma, GSkelton, NSmith, CCSodhi, JWang, WWang, ZXiao, YYuen, PWZak, MZhang, LZheng, XBair, KWDragovich, PS Discovery of potent and efficacious urea-containing nicotinamide phosphoribosyltransferase (NAMPT) inhibitors with reduced CYP2C9 inhibition properties. Bioorg Med Chem Lett23:3531-8 (2013) 
 
Nicotinamide phosphoribosyltransferase
Name:Nicotinamide phosphoribosyltransferase
Type:Enzyme
Mol. Mass.:55524.98
Organism:Homo sapiens (Human)
Description:P43490
Residue:491
BDBM50435766
NameBDBM50435766
Synonyms:CHEMBL2393173
TypeSmall organic molecule
Emp. Form.C19H24N4O4S
Mol. Mass.404.483
SMILESO[C@H]1CCC[C@@H](C1)NS(=O)(=O)c1ccc(NC(=O)NCc2cccnc2)cc1