Reaction Details
TargetNicotinamide phosphoribosyltransferase
LigandBDBM50435777
Substrate/Competitorn/a
Meas. Tech.ChEMBL_966359 (CHEMBL2396492)
IC50 6.0±n/a nM
Citation Gunzner-Toste, JZhao, GBauer, PBaumeister, TBuckmelter, AJCaligiuri, MClodfelter, KHFu, BHan, BHo, YCKley, NLiang, XLiederer, BMLin, JMukadam, SO'Brien, TOh, AReynolds, DJSharma, GSkelton, NSmith, CCSodhi, JWang, WWang, ZXiao, YYuen, PWZak, MZhang, LZheng, XBair, KWDragovich, PS Discovery of potent and efficacious urea-containing nicotinamide phosphoribosyltransferase (NAMPT) inhibitors with reduced CYP2C9 inhibition properties. Bioorg Med Chem Lett23:3531-8 (2013) 
 
Nicotinamide phosphoribosyltransferase
Name:Nicotinamide phosphoribosyltransferase
Type:Enzyme
Mol. Mass.:55524.98
Organism:Homo sapiens (Human)
Description:P43490
Residue:491
BDBM50435777
NameBDBM50435777
Synonyms:CHEMBL2393163
TypeSmall organic molecule
Emp. Form.C21H27N5O3S
Mol. Mass.429.536
SMILESO=C(NCc1cccnc1)Nc1ccc(cc1)S(=O)(=O)N1CCC2(CCNC2)CC1