Reaction Details
TargetReceptor-type tyrosine-protein phosphatase mu
LigandBDBM50436357
Substrate/Competitorn/a
Meas. Tech.ChEMBL_966896 (CHEMBL2401187)
IC50 12000±n/a nM
Citation He, YLiu, SMenon, AStanford, SOppong, EGunawan, AMWu, LWu, DJBarrios, AMBottini, NCato, ACZhang, ZY A potent and selective small-molecule inhibitor for the lymphoid-specific tyrosine phosphatase (LYP), a target associated with autoimmune diseases. J Med Chem56:4990-5008 (2013) 
 
Receptor-type tyrosine-protein phosphatase mu
Name:Receptor-type tyrosine-protein phosphatase mu
Type:Protein
Mol. Mass.:163683.56
Organism:Homo sapiens (Human)
Description:P28827
Residue:1452
BDBM50436357
NameBDBM50436357
Synonyms:CHEMBL2396719
TypeSmall organic molecule
Emp. Form.C28H20ClNO6
Mol. Mass.501.915
SMILESOC(=O)c1cc2c(C#Cc3cccc(Cl)c3)c(oc2cc1O)-c1ccc(OCC(=O)NC2CC2)cc1