Reaction Details
TargetDipeptidyl peptidase 4
LigandBDBM50437403
Substrate/Competitorn/a
Meas. Tech.ChEMBL_972635 (CHEMBL2410615)
IC50 0.05±n/a nM
Citation Czechtizky, WDedio, JDesai, BDixon, KFarrant, EFeng, QMorgan, TParry, DMRamjee, MKSelway, CNSchmidt, TTarver, GJWright, AG Integrated Synthesis and Testing of Substituted Xanthine Based DPP4 Inhibitors: Application to Drug Discovery. ACS Med Chem Lett4:768-72 (2013) 
 
Dipeptidyl peptidase 4
Name:Dipeptidyl peptidase 4
Type:Enzyme
Mol. Mass.:88235.21
Organism:Sus scrofa (pig)
Description:n/a
Residue:766
BDBM50437403
NameBDBM50437403
Synonyms:CHEMBL2408771
TypeSmall organic molecule
Emp. Form.C26H32N6O3
Mol. Mass.476.5707
SMILES[#6]\[#6](-[#6])=[#6]\[#6]-n1c(nc2n(-[#6])c(=O)n(-[#6]-[#6](=O)-c3ccccc3)c(=O)c12)-[#7]-1-[#6]-[#6]-2-[#6]-[#6]-[#6]-[#7]-[#6]-2-[#6]-1