Reaction Details
TargetSphingosine kinase 2
LigandBDBM50438114
Substrate/Competitorn/a
Meas. Tech.ChEMBL_972985 (CHEMBL2412223)
Ki>100000±n/a nM
Citation Gustin, DJLi, YBrown, MLMin, XSchmitt, MJWanska, MWang, XConnors, RJohnstone, SCardozo, MCheng, ACJeffries, SFranks, BLi, SShen, SWong, MWesche, HXu, GCarlson, TJPlant, MMorgenstern, KRex, KSchmitt, JCoxon, AWalker, NKayser, FWang, Z Structure guided design of a series of sphingosine kinase (SphK) inhibitors. Bioorg Med Chem Lett23:4608-16 (2013) 
 
Sphingosine kinase 2
Name:Sphingosine kinase 2
Type:Protein
Mol. Mass.:69221.44
Organism:Homo sapiens (Human)
Description:Q9NRA0
Residue:654
BDBM50438114
NameBDBM50438114
Synonyms:CHEMBL2409758
TypeSmall organic molecule
Emp. Form.C16H25NO2
Mol. Mass.263.3752
SMILESCCCCc1ccc(\C=C\[C@H](O)[C@@H](CO)NC)cc1