Reaction Details
TargetSphingosine kinase 1
LigandBDBM50299323
Substrate/Competitorn/a
Meas. Tech.ChEMBL_972986 (CHEMBL2412224)
Ki 1400±n/a nM
Citation Gustin, DJLi, YBrown, MLMin, XSchmitt, MJWanska, MWang, XConnors, RJohnstone, SCardozo, MCheng, ACJeffries, SFranks, BLi, SShen, SWong, MWesche, HXu, GCarlson, TJPlant, MMorgenstern, KRex, KSchmitt, JCoxon, AWalker, NKayser, FWang, Z Structure guided design of a series of sphingosine kinase (SphK) inhibitors. Bioorg Med Chem Lett23:4608-16 (2013) 
 
Sphingosine kinase 1
Name:Sphingosine kinase 1
Type:Enzyme
Mol. Mass.:42521.16
Organism:Homo sapiens (Human)
Description:Q9NYA1
Residue:384
BDBM50299323
NameBDBM50299323
Synonyms:(S)-2-amino-4-hydroxy-N-(4-octylphenyl)butanamide | CHEMBL583979
TypeSmall organic molecule
Emp. Form.C18H30N2O2
Mol. Mass.306.443
SMILESCCCCCCCCc1ccc(NC(=O)[C@@H](N)CCO)cc1