Reaction Details
TargetSphingosine kinase 1
LigandBDBM50438149
Substrate/Competitorn/a
Meas. Tech.ChEMBL_972986 (CHEMBL2412224)
IC50 50±n/a nM
Citation Gustin, DJLi, YBrown, MLMin, XSchmitt, MJWanska, MWang, XConnors, RJohnstone, SCardozo, MCheng, ACJeffries, SFranks, BLi, SShen, SWong, MWesche, HXu, GCarlson, TJPlant, MMorgenstern, KRex, KSchmitt, JCoxon, AWalker, NKayser, FWang, Z Structure guided design of a series of sphingosine kinase (SphK) inhibitors. Bioorg Med Chem Lett23:4608-16 (2013) 
 
Sphingosine kinase 1
Name:Sphingosine kinase 1
Type:Enzyme
Mol. Mass.:42521.16
Organism:Homo sapiens (Human)
Description:Q9NYA1
Residue:384
BDBM50438149
NameBDBM50438149
Synonyms:CHEMBL2409885
TypeSmall organic molecule
Emp. Form.C24H29N3O3S
Mol. Mass.439.57
SMILESCOc1cccc(c1)-c1csc(Nc2ccc(CCN3CC[C@H](O)C[C@@H]3CO)cc2)n1