Reaction Details
TargetSphingosine kinase 1
LigandBDBM50438142
Substrate/Competitorn/a
Meas. Tech.ChEMBL_972975 (CHEMBL2412213)
IC50 20±n/a nM
Citation Gustin, DJLi, YBrown, MLMin, XSchmitt, MJWanska, MWang, XConnors, RJohnstone, SCardozo, MCheng, ACJeffries, SFranks, BLi, SShen, SWong, MWesche, HXu, GCarlson, TJPlant, MMorgenstern, KRex, KSchmitt, JCoxon, AWalker, NKayser, FWang, Z Structure guided design of a series of sphingosine kinase (SphK) inhibitors. Bioorg Med Chem Lett23:4608-16 (2013) 
 
Sphingosine kinase 1
Name:Sphingosine kinase 1
Type:PROTEIN
Mol. Mass.:42447.37
Organism:Mus musculus
Description:ChEMBL_107622
Residue:382
BDBM50438142
NameBDBM50438142
Synonyms:CHEMBL2409847
TypeSmall organic molecule
Emp. Form.C23H25Cl2N3O2S
Mol. Mass.478.435
SMILESOC[C@H]1C[C@@H](O)CCN1CCc1ccc(Nc2nc(cs2)-c2ccc(Cl)cc2Cl)cc1