Reaction Details
TargetMitogen-activated protein kinase kinase kinase 7
LigandBDBM50438224
Substrate/Competitorn/a
Meas. Tech.ChEMBL_973092 (CHEMBL2412855)
IC50 12±n/a nM
Citation Hornberger, KRBerger, DMCrew, APDong, HKleinberg, ALi, AHMedeiros, MRMulvihill, MJSiu, KTarrant, JWang, JWeng, FWilde, VLAlbertella, MBittner, MCooke, AGray, MJMaresca, PMay, EMeyn, PPeick, WRomashko, DTanowitz, MTokar, B Discovery and optimization of 7-aminofuro[2,3-c]pyridine inhibitors of TAK1. Bioorg Med Chem Lett23:4517-22 (2013) 
 
Mitogen-activated protein kinase kinase kinase 7
Name:Mitogen-activated protein kinase kinase kinase 7
Type:Protein
Mol. Mass.:67199.89
Organism:Homo sapiens (Human)
Description:O43318
Residue:606
BDBM50438224
NameBDBM50438224
Synonyms:CHEMBL2407759
TypeSmall organic molecule
Emp. Form.C23H21N7O2S
Mol. Mass.459.524
SMILESCC(=O)N1CCC(CC1)n1cc(cn1)-c1cnc(N)c2oc(cc12)-c1cccc2nnsc12